BDBM467266 (R)-7-amino-3-(1-(but-2-ynoyl)pyrrolidin-3-yl)- 1-(4-phenoxyphenyl)-1,5-dihydro-4H-pyrrolo [2,3-d]pyridazin-4-one::US10800785, Example 68
SMILES CC#CC(=O)N1CC[C@@H](C1)c1cn(-c2ccc(Oc3ccccc3)cc2)c2c(N)n[nH]c(=O)c12
InChI Key InChIKey=PHISSYWFXLOCLO-KRWDZBQOSA-N
Data  1 IC50
  Tab Delimited (TSV)   2D SDfile   Computed 3D by Vconf -m prep SDfile
Find this compound or compounds like it in BindingDB:
Activity Spreadsheet -- Enzyme Inhibition Constant Data from BindingDB
Found 1 hit for monomerid = 467266
TargetTyrosine-protein kinase BTK(Homo sapiens (Human))
Shanghai Fochon Pharmaceutical
US Patent
LigandPNGBDBM467266((R)-7-amino-3-(1-(but-2-ynoyl)pyrrolidin-3-yl)- 1-...)
Affinity DataIC50:  146nM. Assay description: MTS testing kit was purchased from Promega. The DMEM, Fetal bovine serum and Penicillin-Streptomycin were purchased from Gibco. Dimethyl sulfoxide (D...
Ligand InfoPC cidPC sid
In DepthDetails US Patent